Target
Induced myeloid leukemia cell differentiation protein Mcl-1
Ligand
BDBM53191
Substrate
Meas. Tech.
Fluorescence polarization-based biochemical high throughput dose response assay for inhibitors of myeloid cell leukemia sequence 1 (MCL1) interactions with BIM-BH3 peptide.
IC50
2067±n/a nM
Citation
 PubChem, PC Fluorescence polarization-based biochemical high throughput dose response assay for inhibitors of myeloid cell leukemia sequence 1 (MCL1) interactions with BIM-BH3 peptide. PubChem Bioassay (2009)[AID] 
Target
Name:
Induced myeloid leukemia cell differentiation protein Mcl-1
Synonyms:
BCL2L3 Bcl-2-like protein 3 (Mcl-1) Bcl2-L-3 MCL1 Mcl-1 Myeloid cell leukemia sequence 1 (BCL2-related) | mcl1/EAT
Type:
Membrane; Single-pass membrane protein
Mol. Mass.:
37332.87
Organism:
Homo sapiens (Human)
Description:
Q07820
Residue:
350
  
Inhibitor
Name:
BDBM53191
Synonyms:
3-[[(E)-(2,3-dihydroxy-4-keto-cyclohexa-2,5-dien-1-ylidene)methyl]amino]-2-methyl-quinazolin-4-one 3-[[(E)-(2,3-dihydroxy-4-oxocyclohexa-2,5-dien-1-ylidene)methyl]amino]-2-methylquinazolin-4-one MLS001172635 cid_6301019
Type:
Small organic molecule
Emp. Form.:
C16H13N3O4
Mol. Mass.:
311.2921
SMILES:
Cc1nc2ccccc2c(=O)n1N=Cc1ccc(O)c(O)c1O
: