Target
Bcl-2-like protein 1
Ligand
BDBM61849
Substrate
Meas. Tech.
Counterscreen for inhibitors of MCL1: fluorescence polarization-based biochemical high throughput dose response assay for inhibitors of BCL2-related protein, long isoform (BCLXL).
IC50
108803±n/a nM
Citation
 PubChem, PC Counterscreen for inhibitors of MCL1: fluorescence polarization-based biochemical high throughput dose response assay for inhibitors of BCL2-related protein, long isoform (BCLXL). PubChem Bioassay (2009)[AID] 
Target
Name:
Bcl-2-like protein 1
Synonyms:
Anti-apoptotic Bcl-2 protein Apoptosis regulator Bcl-X BCL2-like 1 isoform 1 BCL2L1 Bcl-2-like protein 1 (Bcl-XL) Bcl-xL/Bcl-2-binding component 3 Bcl2-antagonist of cell death (BAD)
Type:
Mitochondrion membrane; Single-pass membrane protein
Mol. Mass.:
26039.60
Organism:
Homo sapiens (Human)
Description:
Residue:
233
  
Inhibitor
Name:
BDBM61849
Synonyms:
(E)-3-amino-2-[2-[[5-(3-methylanilino)-1,3,4-thiadiazol-2-yl]sulfanyl]acetyl]but-2-enenitrile (E)-3-amino-2-[2-[[5-(m-toluidino)-1,3,4-thiadiazol-2-yl]thio]acetyl]but-2-enenitrile MLS000098447 cid_5742471
Type:
Small organic molecule
Emp. Form.:
C15H15N5OS2
Mol. Mass.:
345.443
SMILES:
CC(=N)C(C#N)C(=O)CSc1nnc(Nc2cccc(C)c2)s1
: