Target
Bcl-2-like protein 1
Ligand
BDBM49131
Substrate
Meas. Tech.
Counterscreen for inhibitors of MCL1: fluorescence polarization-based biochemical high throughput dose response assay for inhibitors of BCL2-related protein, long isoform (BCLXL).
IC50
108803±n/a nM
Citation
 PubChem, PC Counterscreen for inhibitors of MCL1: fluorescence polarization-based biochemical high throughput dose response assay for inhibitors of BCL2-related protein, long isoform (BCLXL). PubChem Bioassay (2009)[AID] 
Target
Name:
Bcl-2-like protein 1
Synonyms:
Anti-apoptotic Bcl-2 protein Apoptosis regulator Bcl-X BCL2-like 1 isoform 1 BCL2L1 Bcl-2-like protein 1 (Bcl-XL) Bcl-xL/Bcl-2-binding component 3 Bcl2-antagonist of cell death (BAD)
Type:
Mitochondrion membrane; Single-pass membrane protein
Mol. Mass.:
26039.60
Organism:
Homo sapiens (Human)
Description:
Residue:
233
  
Inhibitor
Name:
BDBM49131
Synonyms:
MLS000087345 N-(2,4-difluorophenyl)-5,6-dihydro-4H-cyclopenta[d][1,2]oxazole-3-carboxamide N-[2,4-bis(fluoranyl)phenyl]-5,6-dihydro-4H-cyclopenta[d][1,2]oxazole-3-carboxamide cid_3236796
Type:
Small organic molecule
Emp. Form.:
C13H10F2N2O2
Mol. Mass.:
264.2275
SMILES:
Fc1ccc(NC(=O)c2noc3CCCc23)c(F)c1
: