Target
Bcl-2-like protein 1
Ligand
BDBM40694
Substrate
Meas. Tech.
Counterscreen for inhibitors of MCL1: fluorescence polarization-based biochemical high throughput dose response assay for inhibitors of BCL2-related protein, long isoform (BCLXL).
IC50
108803±n/a nM
Citation
 PubChem, PC Counterscreen for inhibitors of MCL1: fluorescence polarization-based biochemical high throughput dose response assay for inhibitors of BCL2-related protein, long isoform (BCLXL). PubChem Bioassay (2009)[AID] 
Target
Name:
Bcl-2-like protein 1
Synonyms:
Anti-apoptotic Bcl-2 protein Apoptosis regulator Bcl-X BCL2-like 1 isoform 1 BCL2L1 Bcl-2-like protein 1 (Bcl-XL) Bcl-xL/Bcl-2-binding component 3 Bcl2-antagonist of cell death (BAD)
Type:
Mitochondrion membrane; Single-pass membrane protein
Mol. Mass.:
26039.60
Organism:
Homo sapiens (Human)
Description:
Residue:
233
  
Inhibitor
Name:
BDBM40694
Synonyms:
2-(2-furanyl)-4-quinolinecarboxylic acid [2-[4-[2-furanyl(oxo)methyl]-1-piperazinyl]-2-oxoethyl] ester MLS000565090 [2-[4-(furan-2-carbonyl)piperazin-1-yl]-2-oxoethyl] 2-(furan-2-yl)quinoline-4-carboxylate cid_2434862
Type:
Small organic molecule
Emp. Form.:
C25H21N3O6
Mol. Mass.:
459.4507
SMILES:
O=C(COC(=O)c1cc(nc2ccccc12)-c1ccco1)N1CCN(CC1)C(=O)c1ccco1
: