Target
Bcl-2-like protein 1
Ligand
BDBM50280
Substrate
Meas. Tech.
Counterscreen for inhibitors of MCL1: fluorescence polarization-based biochemical high throughput dose response assay for inhibitors of BCL2-related protein, long isoform (BCLXL).
IC50
108803±n/a nM
Citation
 PubChem, PC Counterscreen for inhibitors of MCL1: fluorescence polarization-based biochemical high throughput dose response assay for inhibitors of BCL2-related protein, long isoform (BCLXL). PubChem Bioassay (2009)[AID] 
Target
Name:
Bcl-2-like protein 1
Synonyms:
Anti-apoptotic Bcl-2 protein Apoptosis regulator Bcl-X BCL2-like 1 isoform 1 BCL2L1 Bcl-2-like protein 1 (Bcl-XL) Bcl-xL/Bcl-2-binding component 3 Bcl2-antagonist of cell death (BAD)
Type:
Mitochondrion membrane; Single-pass membrane protein
Mol. Mass.:
26039.60
Organism:
Homo sapiens (Human)
Description:
Residue:
233
  
Inhibitor
Name:
BDBM50280
Synonyms:
2-(2-furanyl)-N-(4-methyl-2-thiazolyl)-4-quinolinecarboxamide 2-(furan-2-yl)-N-(4-methyl-1,3-thiazol-2-yl)quinoline-4-carboxamide SMR000260618 | cid_2366866
Type:
Small organic molecule
Emp. Form.:
C18H13N3O2S
Mol. Mass.:
335.38
SMILES:
Cc1csc(NC(=O)c2cc(nc3ccccc23)-c2ccco2)n1
: