Target
Bcl-2-like protein 1
Ligand
BDBM50654
Substrate
Meas. Tech.
Counterscreen for inhibitors of MCL1: fluorescence polarization-based biochemical high throughput dose response assay for inhibitors of BCL2-related protein, long isoform (BCLXL).
IC50
34008±n/a nM
Citation
 PubChem, PC Counterscreen for inhibitors of MCL1: fluorescence polarization-based biochemical high throughput dose response assay for inhibitors of BCL2-related protein, long isoform (BCLXL). PubChem Bioassay (2009)[AID] 
Target
Name:
Bcl-2-like protein 1
Synonyms:
Anti-apoptotic Bcl-2 protein Apoptosis regulator Bcl-X BCL2-like 1 isoform 1 BCL2L1 Bcl-2-like protein 1 (Bcl-XL) Bcl-xL/Bcl-2-binding component 3 Bcl2-antagonist of cell death (BAD)
Type:
Mitochondrion membrane; Single-pass membrane protein
Mol. Mass.:
26039.60
Organism:
Homo sapiens (Human)
Description:
Residue:
233
  
Inhibitor
Name:
BDBM50654
Synonyms:
2-amino-9-(3,4-dihydroxy-5-methylol-tetrahydrofuran-2-yl)-3H-purine-6-thione 2-amino-9-[3,4-dihydroxy-5-(hydroxymethyl)oxolan-2-yl]-3H-purine-6-thione 6-Thioguanosine MLS000738229 cid_3938248
Type:
Small organic molecule
Emp. Form.:
C10H13N5O4S
Mol. Mass.:
299.306
SMILES:
Nc1nc2n(cnc2c(=S)[nH]1)C1OC(CO)C(O)C1O
: