Target
Bcl-2-like protein 1
Ligand
BDBM41892
Substrate
Meas. Tech.
Counterscreen for inhibitors of MCL1: fluorescence polarization-based biochemical high throughput dose response assay for inhibitors of BCL2-related protein, long isoform (BCLXL).
IC50
108803±n/a nM
Citation
 PubChem, PC Counterscreen for inhibitors of MCL1: fluorescence polarization-based biochemical high throughput dose response assay for inhibitors of BCL2-related protein, long isoform (BCLXL). PubChem Bioassay (2009)[AID] 
Target
Name:
Bcl-2-like protein 1
Synonyms:
Anti-apoptotic Bcl-2 protein Apoptosis regulator Bcl-X BCL2-like 1 isoform 1 BCL2L1 Bcl-2-like protein 1 (Bcl-XL) Bcl-xL/Bcl-2-binding component 3 Bcl2-antagonist of cell death (BAD)
Type:
Mitochondrion membrane; Single-pass membrane protein
Mol. Mass.:
26039.60
Organism:
Homo sapiens (Human)
Description:
Residue:
233
  
Inhibitor
Name:
BDBM41892
Synonyms:
1-(3,4-dihydroxyphenyl)-2-[(4-prop-2-enyl-5-pyridin-3-yl-1,2,4-triazol-3-yl)sulfanyl]ethanone 1-[3,4-bis(oxidanyl)phenyl]-2-[(4-prop-2-enyl-5-pyridin-3-yl-1,2,4-triazol-3-yl)sulfanyl]ethanone MLS-0297802.0001 | cid_1400947
Type:
Small organic molecule
Emp. Form.:
C18H16N4O3S
Mol. Mass.:
368.41
SMILES:
Oc1ccc(cc1O)C(=O)CSc1nnc(-c2cccnc2)n1CC=C
: