Target
Bcl-2-like protein 1
Ligand
BDBM61875
Substrate
Meas. Tech.
Counterscreen for inhibitors of MCL1: fluorescence polarization-based biochemical high throughput dose response assay for inhibitors of BCL2-related protein, long isoform (BCLXL).
IC50
108803±n/a nM
Citation
 PubChem, PC Counterscreen for inhibitors of MCL1: fluorescence polarization-based biochemical high throughput dose response assay for inhibitors of BCL2-related protein, long isoform (BCLXL). PubChem Bioassay (2009)[AID] 
Target
Name:
Bcl-2-like protein 1
Synonyms:
Anti-apoptotic Bcl-2 protein Apoptosis regulator Bcl-X BCL2-like 1 isoform 1 BCL2L1 Bcl-2-like protein 1 (Bcl-XL) Bcl-xL/Bcl-2-binding component 3 Bcl2-antagonist of cell death (BAD)
Type:
Mitochondrion membrane; Single-pass membrane protein
Mol. Mass.:
26039.60
Organism:
Homo sapiens (Human)
Description:
Residue:
233
  
Inhibitor
Name:
BDBM61875
Synonyms:
2,2,2-trichloroethyl N-[(1S)-1-(2-phenylcyclopropyl)ethyl]sulfamate MLS001106184 SMR000639495 | cid_24761805
Type:
Small organic molecule
Emp. Form.:
C13H16Cl3NO3S
Mol. Mass.:
372.695
SMILES:
C[C@H](NS(=O)(=O)OCC(Cl)(Cl)Cl)C1CC1c1ccccc1
: