Target
Neuropeptide Y receptor type 2
Ligand
BDBM61788
Substrate
Meas. Tech.
Fluorescence-based counterscreen for agonists of NPY-Y1: cell-based high-throughput dose response assay for agonists of NPY-Y2.
EC50
12090±n/a nM
Citation
 PubChem, PC Fluorescence-based counterscreen for agonists of NPY-Y1: cell-based high-throughput dose response assay for agonists of NPY-Y2. PubChem Bioassay (2009)[AID] 
Target
Name:
Neuropeptide Y receptor type 2
Synonyms:
NPY-Y2 NPY2-R NPY2R_HUMAN Y2 receptor | neuropeptide Y receptor Y2
Type:
Enzyme Catalytic Domain
Mol. Mass.:
42734.65
Organism:
Homo sapiens (Human)
Description:
NPY-Y2 NPY2R HUMAN::P49146
Residue:
381
  
Inhibitor
Name:
BDBM61788
Synonyms:
MLS000765823 N-(4-cyclohexylphenyl)-1-methyl-4-nitro-pyrazole-3-carboxamide SMR000278929 | cid_708088
Type:
Small organic molecule
Emp. Form.:
C17H20N4O3
Mol. Mass.:
328.3657
SMILES:
Cn1cc(c(n1)C(=O)Nc1ccc(cc1)C1CCCCC1)[N+]([O-])=O
: