Target
Neuropeptide Y receptor type 2
Ligand
BDBM25756
Substrate
Meas. Tech.
Fluorescence-based cell-based high-throughput dose response assay for potentiators or agonists of NPY-Y2.
EC50
35430±n/a nM
Citation
 PubChem, PC Fluorescence-based cell-based high-throughput dose response assay for potentiators or agonists of NPY-Y2. PubChem Bioassay (2009)[AID] 
Target
Name:
Neuropeptide Y receptor type 2
Synonyms:
NPY-Y2 NPY2-R NPY2R_HUMAN Y2 receptor | neuropeptide Y receptor Y2
Type:
Enzyme Catalytic Domain
Mol. Mass.:
42734.65
Organism:
Homo sapiens (Human)
Description:
NPY-Y2 NPY2R HUMAN::P49146
Residue:
381
  
Inhibitor
Name:
BDBM25756
Synonyms:
(2R,3R)-2,3-dihydroxysuccinic acid;1-(isopropylamino)-3-[4-(2-methoxyethyl)phenoxy]propan-2-ol CHEMBL13 Spesicor metoprolol tartrate | {2-hydroxy-3-[4-(2-methoxyethyl)phenoxy]propyl}(propan-2-yl)amine
Type:
Small organic molecule
Emp. Form.:
C15H25NO3
Mol. Mass.:
267.3639
SMILES:
COCCc1ccc(OCC(O)CNC(C)C)cc1
: