Target
Neuropeptide Y receptor type 2
Ligand
BDBM57764
Substrate
Meas. Tech.
Fluorescence-based cell-based high-throughput dose response assay for potentiators or agonists of NPY-Y2.
EC50
13219±n/a nM
Citation
 PubChem, PC Fluorescence-based cell-based high-throughput dose response assay for potentiators or agonists of NPY-Y2. PubChem Bioassay (2009)[AID] 
Target
Name:
Neuropeptide Y receptor type 2
Synonyms:
NPY-Y2 NPY2-R NPY2R_HUMAN Y2 receptor | neuropeptide Y receptor Y2
Type:
Enzyme Catalytic Domain
Mol. Mass.:
42734.65
Organism:
Homo sapiens (Human)
Description:
NPY-Y2 NPY2R HUMAN::P49146
Residue:
381
  
Inhibitor
Name:
BDBM57764
Synonyms:
4-(4-anilinoanilino)-2-quinazolinecarboxylic acid ethyl ester MLS000727499 cid_1192552 ethyl 4-[(4-anilinophenyl)amino]quinazoline-2-carboxylate | ethyl 4-[(4-phenylazanylphenyl)amino]quinazoline-2-carboxylate
Type:
Small organic molecule
Emp. Form.:
C23H20N4O2
Mol. Mass.:
384.4305
SMILES:
CCOC(=O)c1nc(Nc2ccc(Nc3ccccc3)cc2)c2ccccc2n1
: