Target
Phosphotransferase
Ligand
BDBM61905
Substrate
Meas. Tech.
Confirmation assay for inhibitors of Trypanosoma brucei hexokinase 1-Analogue-first series
IC50
1820±n/a nM
Citation
 PubChem, PC Confirmation assay for inhibitors of Trypanosoma brucei hexokinase 1-Analogue-first series PubChem Bioassay (2010)[AID] 
Target
Name:
Phosphotransferase
Synonyms:
hexokinase
Type:
Enzyme Catalytic Domain
Mol. Mass.:
51160.00
Organism:
Trypanosoma brucei
Description:
gi_70832125
Residue:
471
  
Inhibitor
Name:
BDBM61905
Synonyms:
2-(3-fluorophenyl)-1,2-benzothiazol-3-one cid_44182101
Type:
Small organic molecule
Emp. Form.:
C13H8FNOS
Mol. Mass.:
245.272
SMILES:
Fc1cccc(c1)-n1sc2ccccc2c1=O
: