Target
Phosphotransferase
Ligand
BDBM61906
Substrate
Meas. Tech.
Confirmation assay for inhibitors of Trypanosoma brucei hexokinase 1-Analogue-first series
IC50
25000±n/a nM
Citation
 PubChem, PC Confirmation assay for inhibitors of Trypanosoma brucei hexokinase 1-Analogue-first series PubChem Bioassay (2010)[AID] 
Target
Name:
Phosphotransferase
Synonyms:
hexokinase
Type:
Enzyme Catalytic Domain
Mol. Mass.:
51160.00
Organism:
Trypanosoma brucei
Description:
gi_70832125
Residue:
471
  
Inhibitor
Name:
BDBM61906
Synonyms:
2-(3-fluorophenyl)-1-keto-1,2-benzothiazol-3-one 2-(3-fluorophenyl)-1-oxo-1,2-benzothiazol-3-one cid_44462705
Type:
Small organic molecule
Emp. Form.:
C13H8FNO2S
Mol. Mass.:
261.272
SMILES:
Fc1cccc(c1)-n1c(=O)c2ccccc2s1=O
: