Target
Phosphotransferase
Ligand
BDBM61910
Substrate
Meas. Tech.
Confirmation assay for inhibitors of Trypanosoma brucei hexokinase 1-Analogue-first series
IC50
2310±n/a nM
Citation
 PubChem, PC Confirmation assay for inhibitors of Trypanosoma brucei hexokinase 1-Analogue-first series PubChem Bioassay (2010)[AID] 
Target
Name:
Phosphotransferase
Synonyms:
hexokinase
Type:
Enzyme Catalytic Domain
Mol. Mass.:
51160.00
Organism:
Trypanosoma brucei
Description:
gi_70832125
Residue:
471
  
Inhibitor
Name:
BDBM61910
Synonyms:
6-fluoranyl-2-phenyl-1,2-benzothiazol-3-one KUC103671N | cid_1510378
Type:
Small organic molecule
Emp. Form.:
C13H8FNOS
Mol. Mass.:
245.272
SMILES:
Fc1ccc2c(c1)sn(-c1ccccc1)c2=O
: