Target
Phosphotransferase
Ligand
BDBM61933
Substrate
Meas. Tech.
Confirmation assay for inhibitors of Trypanosoma brucei hexokinase 1-Analogue-first series
IC50
5030±n/a nM
Citation
 PubChem, PC Confirmation assay for inhibitors of Trypanosoma brucei hexokinase 1-Analogue-first series PubChem Bioassay (2010)[AID] 
Target
Name:
Phosphotransferase
Synonyms:
hexokinase
Type:
Enzyme Catalytic Domain
Mol. Mass.:
51160.00
Organism:
Trypanosoma brucei
Description:
gi_70832125
Residue:
471
  
Inhibitor
Name:
BDBM61933
Synonyms:
2-(3-keto-1,2-benzothiazol-2-yl)-N-(3-methoxyphenyl)acetamide KUC104220N N-(3-methoxyphenyl)-2-(3-oxo-1,2-benzothiazol-2-yl)acetamide | cid_8892687
Type:
Small organic molecule
Emp. Form.:
C16H14N2O3S
Mol. Mass.:
314.359
SMILES:
COc1cccc(NC(=O)Cn2sc3ccccc3c2=O)c1
: