Target
Phosphotransferase
Ligand
BDBM61958
Substrate
Meas. Tech.
Confirmation assay for inhibitors of Trypanosoma brucei hexokinase 1-Analogue-first series
IC50
2995±n/a nM
Citation
 PubChem, PC Confirmation assay for inhibitors of Trypanosoma brucei hexokinase 1-Analogue-first series PubChem Bioassay (2010)[AID] 
Target
Name:
Phosphotransferase
Synonyms:
hexokinase
Type:
Enzyme Catalytic Domain
Mol. Mass.:
51160.00
Organism:
Trypanosoma brucei
Description:
gi_70832125
Residue:
471
  
Inhibitor
Name:
BDBM61958
Synonyms:
6-methoxy-2-phenyl-1,2-benzothiazol-3-one KUC105410N | cid_22416269
Type:
Small organic molecule
Emp. Form.:
C14H11NO2S
Mol. Mass.:
257.308
SMILES:
COc1ccc2c(c1)sn(-c1ccccc1)c2=O
: