Target
Phosphotransferase
Ligand
BDBM62052
Substrate
Meas. Tech.
Confirmation assay for inhibitors of Trypanosoma brucei hexokinase 1-Analogue-first series
IC50
5410±n/a nM
Citation
 PubChem, PC Confirmation assay for inhibitors of Trypanosoma brucei hexokinase 1-Analogue-first series PubChem Bioassay (2010)[AID] 
Target
Name:
Phosphotransferase
Synonyms:
hexokinase
Type:
Enzyme Catalytic Domain
Mol. Mass.:
51160.00
Organism:
Trypanosoma brucei
Description:
gi_70832125
Residue:
471
  
Inhibitor
Name:
BDBM62052
Synonyms:
4-chloranyl-2-(naphthalen-2-ylcarbonylamino)benzoic acid 4-chloro-2-(naphthalene-2-carbonylamino)benzoic acid KSC-20-021 cid_9321758
Type:
Small organic molecule
Emp. Form.:
C18H12ClNO3
Mol. Mass.:
325.746
SMILES:
OC(=O)c1ccc(Cl)cc1NC(=O)c1ccc2ccccc2c1
: