Target
Neuropeptides B/W receptor type 1
Ligand
BDBM54782
Substrate
Meas. Tech.
Fluorescence-based dose response cell-based high throughput screening assay to identify antagonists of the G-protein coupled receptor 7 (GPR7).
IC50
43807±n/a nM
Citation
 PubChem, PC Fluorescence-based dose response cell-based high throughput screening assay to identify antagonists of the G-protein coupled receptor 7 (GPR7). PubChem Bioassay (2010)[AID] 
Target
Name:
Neuropeptides B/W receptor type 1
Synonyms:
GPR7 NPBWR1 | neuropeptides B/W receptor 1
Type:
Enzyme Catalytic Domain
Mol. Mass.:
36111.82
Organism:
Homo sapiens (Human)
Description:
gi_119607128
Residue:
328
  
Inhibitor
Name:
BDBM54782
Synonyms:
MLS000519747 N-[1-(cyclopentylcarbamoyl)cyclohexyl]-N-(furan-2-ylmethyl)pyridine-2-carboxamide SMR000130165 | cid_3626869
Type:
Small organic molecule
Emp. Form.:
C23H29N3O3
Mol. Mass.:
395.4947
SMILES:
O=C(NC1CCCC1)C1(CCCCC1)N(Cc1ccco1)C(=O)c1ccccn1
: