Target
Neuropeptides B/W receptor type 1
Ligand
BDBM62088
Substrate
Meas. Tech.
Fluorescence-based dose response cell-based high throughput screening assay to identify antagonists of the G-protein coupled receptor 7 (GPR7).
IC50
2936±n/a nM
Citation
 PubChem, PC Fluorescence-based dose response cell-based high throughput screening assay to identify antagonists of the G-protein coupled receptor 7 (GPR7). PubChem Bioassay (2010)[AID] 
Target
Name:
Neuropeptides B/W receptor type 1
Synonyms:
GPR7 NPBWR1 | neuropeptides B/W receptor 1
Type:
Enzyme Catalytic Domain
Mol. Mass.:
36111.82
Organism:
Homo sapiens (Human)
Description:
gi_119607128
Residue:
328
  
Inhibitor
Name:
BDBM62088
Synonyms:
5-chloranyl-4-(4-methoxyphenoxy)-2-(4-methylphenyl)pyridazin-3-one 5-chloro-4-(4-methoxyphenoxy)-2-(4-methylphenyl)-3-pyridazinone 5-chloro-4-(4-methoxyphenoxy)-2-(p-tolyl)pyridazin-3-one SMR000179329 | cid_1479652
Type:
Small organic molecule
Emp. Form.:
C18H15ClN2O3
Mol. Mass.:
342.776
SMILES:
COc1ccc(Oc2c(Cl)cnn(-c3ccc(C)cc3)c2=O)cc1
: