Target
Neuropeptides B/W receptor type 1
Ligand
BDBM62096
Substrate
Meas. Tech.
Fluorescence-based dose response cell-based high throughput screening assay to identify antagonists of the G-protein coupled receptor 7 (GPR7).
IC50
42805±n/a nM
Citation
 PubChem, PC Fluorescence-based dose response cell-based high throughput screening assay to identify antagonists of the G-protein coupled receptor 7 (GPR7). PubChem Bioassay (2010)[AID] 
Target
Name:
Neuropeptides B/W receptor type 1
Synonyms:
GPR7 NPBWR1 | neuropeptides B/W receptor 1
Type:
Enzyme Catalytic Domain
Mol. Mass.:
36111.82
Organism:
Homo sapiens (Human)
Description:
gi_119607128
Residue:
328
  
Inhibitor
Name:
BDBM62096
Synonyms:
1-(4-chlorophenyl)-3-[[1,3-diketo-2-(p-tolyl)-7,7a-dihydro-3aH-octahydro-1H-4,7-epoxyisoindol-4-yl]methyl]thiourea 1-(4-chlorophenyl)-3-[[2-(4-methylphenyl)-1,3-dioxo-7,7a-dihydro-3aH-octahydro-1H-4,7-epoxyisoindol-4-yl]methyl]thiourea N-(4-chlorophenyl)-N'-{[2-(4-methylphenyl)-1,3-dioxo-1,2,3,3a,7,7a-hexahydro-4H-4,7-epoxyisoindol-4-yl]methyl}thiourea cid_12005269
Type:
Small organic molecule
Emp. Form.:
C23H20ClN3O3S
Mol. Mass.:
453.941
SMILES:
[H]C12OC(CNC(=S)Nc3ccc(Cl)cc3)(C=C1)c1c(O)n(c(O)c21)-c1ccc(C)cc1
: