Target
Neuropeptides B/W receptor type 1
Ligand
BDBM62145
Substrate
Meas. Tech.
Fluorescence-based dose response cell-based high throughput screening assay to identify antagonists of the G-protein coupled receptor 7 (GPR7).
IC50
13425±n/a nM
Citation
 PubChem, PC Fluorescence-based dose response cell-based high throughput screening assay to identify antagonists of the G-protein coupled receptor 7 (GPR7). PubChem Bioassay (2010)[AID] 
Target
Name:
Neuropeptides B/W receptor type 1
Synonyms:
GPR7 NPBWR1 | neuropeptides B/W receptor 1
Type:
Enzyme Catalytic Domain
Mol. Mass.:
36111.82
Organism:
Homo sapiens (Human)
Description:
gi_119607128
Residue:
328
  
Inhibitor
Name:
BDBM62145
Synonyms:
MLS000947934 cid_3643960
Type:
Small organic molecule
Emp. Form.:
C18H24Br2N2O3
Mol. Mass.:
476.203
SMILES:
[H]C12CC([H])(C(Br)C1Br)C1C2C(=O)N(CC(=O)N(C)C2CCCCC2)C1=O
: