Target
Neuropeptides B/W receptor type 1
Ligand
BDBM62148
Substrate
Meas. Tech.
Fluorescence-based dose response cell-based high throughput screening assay to identify antagonists of the G-protein coupled receptor 7 (GPR7).
IC50
6890±n/a nM
Citation
 PubChem, PC Fluorescence-based dose response cell-based high throughput screening assay to identify antagonists of the G-protein coupled receptor 7 (GPR7). PubChem Bioassay (2010)[AID] 
Target
Name:
Neuropeptides B/W receptor type 1
Synonyms:
GPR7 NPBWR1 | neuropeptides B/W receptor 1
Type:
Enzyme Catalytic Domain
Mol. Mass.:
36111.82
Organism:
Homo sapiens (Human)
Description:
gi_119607128
Residue:
328
  
Inhibitor
Name:
BDBM62148
Synonyms:
5-[(4-methylphenyl)methyl]-N-(3-morpholin-4-ylpropyl)-6-oxidanylidene-benzo[b][1,4]benzothiazepine-3-carboxamide 5-[(4-methylphenyl)methyl]-N-[3-(4-morpholinyl)propyl]-6-oxo-3-benzo[b][1,4]benzothiazepinecarboxamide MLS001031207 cid_4062524
Type:
Small organic molecule
Emp. Form.:
C29H31N3O3S
Mol. Mass.:
501.64
SMILES:
Cc1ccc(CN2c3cc(ccc3Sc3ccccc3C2=O)C(=O)NCCCN2CCOCC2)cc1
: