Target
Neuropeptides B/W receptor type 1
Ligand
BDBM62156
Substrate
Meas. Tech.
Fluorescence-based dose response cell-based high throughput screening assay to identify antagonists of the G-protein coupled receptor 7 (GPR7).
IC50
43807±n/a nM
Citation
 PubChem, PC Fluorescence-based dose response cell-based high throughput screening assay to identify antagonists of the G-protein coupled receptor 7 (GPR7). PubChem Bioassay (2010)[AID] 
Target
Name:
Neuropeptides B/W receptor type 1
Synonyms:
GPR7 NPBWR1 | neuropeptides B/W receptor 1
Type:
Enzyme Catalytic Domain
Mol. Mass.:
36111.82
Organism:
Homo sapiens (Human)
Description:
gi_119607128
Residue:
328
  
Inhibitor
Name:
BDBM62156
Synonyms:
5-Nitro-furan-2-carboxylic acid [2-(4-isobutyryl-piperazin-1-yl)-phenyl]-amide N-[2-(4-isobutyrylpiperazino)phenyl]-5-nitro-2-furamide N-[2-[4-(2-methylpropanoyl)piperazin-1-yl]phenyl]-5-nitro-furan-2-carboxamide SMR000612696 | cid_1091600
Type:
Small organic molecule
Emp. Form.:
C19H22N4O5
Mol. Mass.:
386.4018
SMILES:
CC(C)C(=O)N1CCN(CC1)c1ccccc1NC(=O)c1ccc(o1)[N+]([O-])=O
: