Target
Nucleotide-binding oligomerization domain-containing protein 1
Ligand
BDBM62172
Substrate
Meas. Tech.
SAR analysis of NF-kB dependent luciferase using DAP as an inducer
IC50
2481±n/a nM
Citation
 PubChem, PC SAR analysis of NF-kB dependent luciferase using DAP as an inducer PubChem Bioassay (2010)[AID] 
Target
Name:
Nucleotide-binding oligomerization domain-containing protein 1
Synonyms:
CARD4 NOD1_HUMAN | nucleotide-binding oligomerization domain containing 1
Type:
Enzyme Catalytic Domain
Mol. Mass.:
107699.03
Organism:
Homo sapiens (Human)
Description:
gi_5174617
Residue:
953
  
Inhibitor
Name:
BDBM62172
Synonyms:
1-(4-methoxyphenyl)sulfonyl-2-benzimidazolamine MLS-0425616.0001 cid_44229066
Type:
Small organic molecule
Emp. Form.:
C14H13N3O3S
Mol. Mass.:
303.336
SMILES:
COc1ccc(cc1)S(=O)(=O)n1c(N)nc2ccccc12
: