Target
Kappa-type opioid receptor
Ligand
BDBM54775
Substrate
Meas. Tech.
SAR analysis of small molecule agonists of the kappa opioid receptor via a luminescent beta-arrestin assay
EC50
1860±n/a nM
Citation
 PubChem, PC SAR analysis of small molecule agonists of the kappa opioid receptor via a luminescent beta-arrestin assay PubChem Bioassay (2010)[AID] 
Target
Name:
Kappa-type opioid receptor
Synonyms:
K-OR-1 Kappa-opioid receptor (KOR) Kappa-type opioid receptor (KOR) OPIATE Kappa OPRK1 kappa opioid receptor (KOR)
Type:
G Protein-Coupled Receptor (GPCR)
Mol. Mass.:
42648.76
Organism:
Homo sapiens (Human)
Description:
P41145
Residue:
380
  
Inhibitor
Name:
BDBM54775
Synonyms:
2-[5-[(2,4-dichlorobenzyl)thio]-4-(2-furfuryl)-1,2,4-triazol-3-yl]pyridine 2-[5-[(2,4-dichlorophenyl)methylthio]-4-(2-furanylmethyl)-1,2,4-triazol-3-yl]pyridine SMR000043634 | cid_662944
Type:
Small organic molecule
Emp. Form.:
C19H14Cl2N4OS
Mol. Mass.:
417.312
SMILES:
Clc1ccc(CSc2nnc(-c3ccccn3)n2Cc2ccco2)c(Cl)c1
: