Target
Kappa-type opioid receptor
Ligand
BDBM54779
Substrate
Meas. Tech.
SAR analysis of small molecule agonists of the kappa opioid receptor via a luminescent beta-arrestin assay
EC50
4050±n/a nM
Citation
 PubChem, PC SAR analysis of small molecule agonists of the kappa opioid receptor via a luminescent beta-arrestin assay PubChem Bioassay (2010)[AID] 
Target
Name:
Kappa-type opioid receptor
Synonyms:
K-OR-1 Kappa-opioid receptor (KOR) Kappa-type opioid receptor (KOR) OPIATE Kappa OPRK1 kappa opioid receptor (KOR)
Type:
G Protein-Coupled Receptor (GPCR)
Mol. Mass.:
42648.76
Organism:
Homo sapiens (Human)
Description:
P41145
Residue:
380
  
Inhibitor
Name:
BDBM54779
Synonyms:
MLS000048990 N-[1-[(2,6-dimethylanilino)-oxomethyl]cyclopentyl]-N-(2-furanylmethyl)-2-pyridinecarboxamide N-[1-[(2,6-dimethylphenyl)carbamoyl]cyclopentyl]-N-(furan-2-ylmethyl)pyridine-2-carboxamide cid_1297443
Type:
Small organic molecule
Emp. Form.:
C25H27N3O3
Mol. Mass.:
417.5002
SMILES:
Cc1cccc(C)c1NC(=O)C1(CCCC1)N(Cc1ccco1)C(=O)c1ccccn1
: