Target
Kappa-type opioid receptor
Ligand
BDBM62183
Substrate
Meas. Tech.
SAR analysis of small molecule agonists of the kappa opioid receptor via a luminescent beta-arrestin assay
EC50
10000±n/a nM
Citation
 PubChem, PC SAR analysis of small molecule agonists of the kappa opioid receptor via a luminescent beta-arrestin assay PubChem Bioassay (2010)[AID] 
Target
Name:
Kappa-type opioid receptor
Synonyms:
K-OR-1 Kappa-opioid receptor (KOR) Kappa-type opioid receptor (KOR) OPIATE Kappa OPRK1 kappa opioid receptor (KOR)
Type:
G Protein-Coupled Receptor (GPCR)
Mol. Mass.:
42648.76
Organism:
Homo sapiens (Human)
Description:
P41145
Residue:
380
  
Inhibitor
Name:
BDBM62183
Synonyms:
MLS-0425691.0001 [4-[(4-methoxyphenyl)methyl]-1-[[1-(3-methylphenyl)-2-imidazolyl]methyl]-4-piperidinyl]methanol cid_44537712
Type:
Small organic molecule
Emp. Form.:
C25H31N3O2
Mol. Mass.:
405.5325
SMILES:
COc1ccc(CC2(CO)CCN(Cc3nccn3-c3cccc(C)c3)CC2)cc1
: