Target
Kappa-type opioid receptor
Ligand
BDBM62191
Substrate
Meas. Tech.
SAR analysis of small molecule antagonists of the kappa opioid receptor via a luminescent beta-arrestin assay
IC50
10000±n/a nM
Citation
 PubChem, PC SAR analysis of small molecule antagonists of the kappa opioid receptor via a luminescent beta-arrestin assay PubChem Bioassay (2010)[AID] 
Target
Name:
Kappa-type opioid receptor
Synonyms:
K-OR-1 Kappa-opioid receptor (KOR) Kappa-type opioid receptor (KOR) OPIATE Kappa OPRK1 kappa opioid receptor (KOR)
Type:
G Protein-Coupled Receptor (GPCR)
Mol. Mass.:
42648.76
Organism:
Homo sapiens (Human)
Description:
P41145
Residue:
380
  
Inhibitor
Name:
BDBM62191
Synonyms:
MLS-0071544.0001 N-[[4-(4-benzylpiperazine-1-carbonyl)phenyl]methyl]benzenesulfonamide N-[[4-[oxo-[4-(phenylmethyl)-1-piperazinyl]methyl]phenyl]methyl]benzenesulfonamide | cid_9550286
Type:
Small organic molecule
Emp. Form.:
C25H27N3O3S
Mol. Mass.:
449.565
SMILES:
O=C(N1CCN(Cc2ccccc2)CC1)c1ccc(CNS(=O)(=O)c2ccccc2)cc1
: