Target
Kappa-type opioid receptor
Ligand
BDBM62194
Substrate
Meas. Tech.
SAR analysis of small molecule antagonists of the kappa opioid receptor via a luminescent beta-arrestin assay
IC50
2090±n/a nM
Citation
 PubChem, PC SAR analysis of small molecule antagonists of the kappa opioid receptor via a luminescent beta-arrestin assay PubChem Bioassay (2010)[AID] 
Target
Name:
Kappa-type opioid receptor
Synonyms:
K-OR-1 Kappa-opioid receptor (KOR) Kappa-type opioid receptor (KOR) OPIATE Kappa OPRK1 kappa opioid receptor (KOR)
Type:
G Protein-Coupled Receptor (GPCR)
Mol. Mass.:
42648.76
Organism:
Homo sapiens (Human)
Description:
P41145
Residue:
380
  
Inhibitor
Name:
BDBM62194
Synonyms:
(phenylmethyl) N-[2,2,2-tris(chloranyl)-1-[(2,4-dichlorophenyl)carbamothioylamino]ethyl]carbamate N-[2,2,2-trichloro-1-[(2,4-dichlorophenyl)thiocarbamoylamino]ethyl]carbamic acid benzyl ester benzyl N-[2,2,2-trichloro-1-[(2,4-dichlorophenyl)carbamothioylamino]ethyl]carbamate | cid_3093316
Type:
Small organic molecule
Emp. Form.:
C17H14Cl5N3O2S
Mol. Mass.:
501.642
SMILES:
Clc1ccc(NC(=S)NC(NC(=O)OCc2ccccc2)C(Cl)(Cl)Cl)c(Cl)c1
: