Target
Regulator of G-protein signaling 8
Ligand
BDBM34524
Substrate
Meas. Tech.
Dose response, multiplexed high-throughput screen for small molecule regulators of RGS family protein interactions, specifically RGS8-Galphao for SAR Compounds
EC50
550±n/a nM
Citation
 PubChem, PC Dose response, multiplexed high-throughput screen for small molecule regulators of RGS family protein interactions, specifically RGS8-Galphao for SAR Compounds PubChem Bioassay (2010)[AID] 
Target
Name:
Regulator of G-protein signaling 8
Synonyms:
RGS8 Regulator of G-protein signaling 8 (RGS8)
Type:
Enzyme Catalytic Domain
Mol. Mass.:
20925.80
Organism:
Homo sapiens (Human)
Description:
gi_74355113
Residue:
180
  
Inhibitor
Name:
BDBM34524
Synonyms:
2-[2-keto-2-[3-methyl-4-(m-tolyl)piperazino]ethyl]-4,6-dimethyl-isothiazolo[5,4-b]pyridin-3-one 4,6-dimethyl-2-[2-[3-methyl-4-(3-methylphenyl)piperazin-1-yl]-2-oxidanylidene-ethyl]-[1,2]thiazolo[5,4-b]pyridin-3-one MLS000118900 cid_5309798
Type:
Small organic molecule
Emp. Form.:
C22H26N4O2S
Mol. Mass.:
410.532
SMILES:
CC1CN(CCN1c1cccc(C)c1)C(=O)Cn1sc2nc(C)cc(C)c2c1=O
: