Target
Regulator of G-protein signaling 8
Ligand
BDBM47776
Substrate
Meas. Tech.
Dose response, multiplexed high-throughput screen for small molecule regulators of RGS family protein interactions, specifically RGS8-Galphao for SAR Compounds
EC50
30000±n/a nM
Citation
 PubChem, PC Dose response, multiplexed high-throughput screen for small molecule regulators of RGS family protein interactions, specifically RGS8-Galphao for SAR Compounds PubChem Bioassay (2010)[AID] 
Target
Name:
Regulator of G-protein signaling 8
Synonyms:
RGS8 Regulator of G-protein signaling 8 (RGS8)
Type:
Enzyme Catalytic Domain
Mol. Mass.:
20925.80
Organism:
Homo sapiens (Human)
Description:
gi_74355113
Residue:
180
  
Inhibitor
Name:
BDBM47776
Synonyms:
3-chloranyl-N-(3-morpholin-4-ylpropyl)-6-nitro-1-benzothiophene-2-carboxamide 3-chloro-N-(3-morpholinopropyl)-6-nitro-benzothiophene-2-carboxamide MLS000684370 cid_2225472
Type:
Small organic molecule
Emp. Form.:
C16H18ClN3O4S
Mol. Mass.:
383.85
SMILES:
[O-][N+](=O)c1ccc2c(Cl)c(sc2c1)C(=O)NCCCN1CCOCC1
: