Target
Regulator of G-protein signaling 19
Ligand
BDBM62216
Substrate
Meas. Tech.
Dose response, multiplexed high-throughput screen for small molecule regulators of RGS family protein interactions, specifically RGS19-Galphao for SAR Compounds
EC50
590±n/a nM
Citation
 PubChem, PC Dose response, multiplexed high-throughput screen for small molecule regulators of RGS family protein interactions, specifically RGS19-Galphao for SAR Compounds PubChem Bioassay (2010)[AID] 
Target
Name:
Regulator of G-protein signaling 19
Synonyms:
G protein signalling regulator 19 GNAI3IP RGS19_HUMAN | Regulator of G-protein signaling 19 (RGS19)
Type:
Enzyme Catalytic Domain
Mol. Mass.:
24631.38
Organism:
Homo sapiens (Human)
Description:
gi_86990435
Residue:
217
  
Inhibitor
Name:
BDBM62216
Synonyms:
2-(4,6-dimethylisothiazolo[5,4-b]pyridin-3-yl)oxy-1-[3-methyl-4-(m-tolyl)piperazino]ethanone 2-[(4,6-dimethyl-[1,2]thiazolo[5,4-b]pyridin-3-yl)oxy]-1-[3-methyl-4-(3-methylphenyl)piperazin-1-yl]ethanone UNM-0000305811 | cid_25227363
Type:
Small organic molecule
Emp. Form.:
C22H26N4O2S
Mol. Mass.:
410.532
SMILES:
CC1CN(CCN1c1cccc(C)c1)C(=O)COc1nsc2nc(C)cc(C)c12
: