Target
Sphingosine 1-phosphate receptor 4
Ligand
BDBM60223
Substrate
Meas. Tech.
Late stage fluorescence dose response cell-based screening assay for antagonists of the Sphingosine 1-Phosphate Receptor 4 (S1P4)
IC50
550.2±n/a nM
Citation
 PubChem, PC Late stage fluorescence dose response cell-based screening assay for antagonists of the Sphingosine 1-Phosphate Receptor 4 (S1P4) PubChem Bioassay (2010)[AID] 
Target
Name:
Sphingosine 1-phosphate receptor 4
Synonyms:
EDG6 S1P receptor 4 S1P4 S1PR4_HUMAN Sphingosine 1-phosphate receptor Edg-6 sphingosine-1-phosphate 4 S1P4
Type:
G Protein-Coupled Receptor (GPCR)
Mol. Mass.:
41647.39
Organism:
Homo sapiens (Human)
Description:
Residue:
384
  
Inhibitor
Name:
BDBM60223
Synonyms:
4-methyl-N-(8-quinolinyl)benzenesulfonamide 4-methyl-N-8-quinolinylbenzenesulfonamide 4-methyl-N-quinolin-8-ylbenzenesulfonamide SMR000135149 | cid_82533
Type:
Small organic molecule
Emp. Form.:
C16H14N2O2S
Mol. Mass.:
298.36
SMILES:
Cc1ccc(cc1)S(=O)(=O)Nc1cccc2cccnc12
: