Target
Sphingosine 1-phosphate receptor 4
Ligand
BDBM57129
Substrate
Meas. Tech.
Late stage fluorescence dose response cell-based screening assay for antagonists of the Sphingosine 1-Phosphate Receptor 4 (S1P4)
IC50
770.3±n/a nM
Citation
 PubChem, PC Late stage fluorescence dose response cell-based screening assay for antagonists of the Sphingosine 1-Phosphate Receptor 4 (S1P4) PubChem Bioassay (2010)[AID] 
Target
Name:
Sphingosine 1-phosphate receptor 4
Synonyms:
EDG6 S1P receptor 4 S1P4 S1PR4_HUMAN Sphingosine 1-phosphate receptor Edg-6 sphingosine-1-phosphate 4 S1P4
Type:
G Protein-Coupled Receptor (GPCR)
Mol. Mass.:
41647.39
Organism:
Homo sapiens (Human)
Description:
Residue:
384
  
Inhibitor
Name:
BDBM57129
Synonyms:
2-({2-nitro-4-[(trifluoromethyl)sulfonyl]phenyl}thio)-1H-benzimidazole 2-[2-nitro-4-(trifluoromethylsulfonyl)phenyl]sulfanyl-1H-benzimidazole MLS000533685 cid_1336753
Type:
Small organic molecule
Emp. Form.:
C14H8F3N3O4S2
Mol. Mass.:
403.356
SMILES:
[O-][N+](=O)c1cc(ccc1Sc1nc2ccccc2[nH]1)S(=O)(=O)C(F)(F)F
: