Target
Nucleotide-binding oligomerization domain-containing protein 1
Ligand
BDBM62234
Substrate
Meas. Tech.
SAR analysis of compounds that inhibit NOD1 revised
IC50
418±n/a nM
Citation
 PubChem, PC SAR analysis of compounds that inhibit NOD1 revised PubChem Bioassay (2010)[AID] 
Target
Name:
Nucleotide-binding oligomerization domain-containing protein 1
Synonyms:
CARD4 NOD1_HUMAN | nucleotide-binding oligomerization domain containing 1
Type:
Enzyme Catalytic Domain
Mol. Mass.:
107699.03
Organism:
Homo sapiens (Human)
Description:
gi_5174617
Residue:
953
  
Inhibitor
Name:
BDBM62234
Synonyms:
4-(3,4-dihydro-1H-isoquinolin-2-ylmethyl)-N-(4-pyrrolidin-1-ylsulfonylphenyl)benzamide 4-(3,4-dihydro-1H-isoquinolin-2-ylmethyl)-N-[4-(1-pyrrolidinylsulfonyl)phenyl]benzamide cid_2211281
Type:
Small organic molecule
Emp. Form.:
C27H29N3O3S
Mol. Mass.:
475.602
SMILES:
O=C(Nc1ccc(cc1)S(=O)(=O)N1CCCC1)c1ccc(CN2CCc3ccccc3C2)cc1
: