Target
Nucleotide-binding oligomerization domain-containing protein 1
Ligand
BDBM54524
Substrate
Meas. Tech.
SAR analysis of compounds that inhibit NOD1 revised
IC50
968±n/a nM
Citation
 PubChem, PC SAR analysis of compounds that inhibit NOD1 revised PubChem Bioassay (2010)[AID] 
Target
Name:
Nucleotide-binding oligomerization domain-containing protein 1
Synonyms:
CARD4 NOD1_HUMAN | nucleotide-binding oligomerization domain containing 1
Type:
Enzyme Catalytic Domain
Mol. Mass.:
107699.03
Organism:
Homo sapiens (Human)
Description:
gi_5174617
Residue:
953
  
Inhibitor
Name:
BDBM54524
Synonyms:
MLS001101361 N-[1-(2-fluorophenyl)-4,5,6,7-tetrahydroindazol-4-yl]-2-methyl-pyrazole-3-carboxamide SMR000653893 | cid_24817447
Type:
Small organic molecule
Emp. Form.:
C18H18FN5O
Mol. Mass.:
339.3668
SMILES:
Cn1nccc1C(=O)NC1CCCc2c1cnn2-c1ccccc1F
: