Target
Nucleotide-binding oligomerization domain-containing protein 1
Ligand
BDBM62251
Substrate
Meas. Tech.
SAR analysis of compounds that inhibit NOD1 revised
IC50
260±n/a nM
Citation
 PubChem, PC SAR analysis of compounds that inhibit NOD1 revised PubChem Bioassay (2010)[AID] 
Target
Name:
Nucleotide-binding oligomerization domain-containing protein 1
Synonyms:
CARD4 NOD1_HUMAN | nucleotide-binding oligomerization domain containing 1
Type:
Enzyme Catalytic Domain
Mol. Mass.:
107699.03
Organism:
Homo sapiens (Human)
Description:
gi_5174617
Residue:
953
  
Inhibitor
Name:
BDBM62251
Synonyms:
MLS-0412140.0001 cyclopropyl-[2-methyl-5-[4-(4-nitrophenyl)piperazin-1-yl]sulfonyl-2,3-dihydroindol-1-yl]methanone cyclopropyl-[2-methyl-5-[[4-(4-nitrophenyl)-1-piperazinyl]sulfonyl]-2,3-dihydroindol-1-yl]methanone
Type:
Small organic molecule
Emp. Form.:
C23H26N4O5S
Mol. Mass.:
470.541
SMILES:
CC1Cc2cc(ccc2N1C(=O)C1CC1)S(=O)(=O)N1CCN(CC1)c1ccc(cc1)[N+]([O-])=O
: