Target
Nucleotide-binding oligomerization domain-containing protein 1
Ligand
BDBM54413
Substrate
Meas. Tech.
SAR analysis of compounds that inhibit NOD1 revised
IC50
833±n/a nM
Citation
 PubChem, PC SAR analysis of compounds that inhibit NOD1 revised PubChem Bioassay (2010)[AID] 
Target
Name:
Nucleotide-binding oligomerization domain-containing protein 1
Synonyms:
CARD4 NOD1_HUMAN | nucleotide-binding oligomerization domain containing 1
Type:
Enzyme Catalytic Domain
Mol. Mass.:
107699.03
Organism:
Homo sapiens (Human)
Description:
gi_5174617
Residue:
953
  
Inhibitor
Name:
BDBM54413
Synonyms:
CHEMBL1612423 N-(4-Chloro-phenyl)-4-(3,4-dihydro-1H-isoquinolin-2-ylmethyl)-benzamide SMR000515365 | cid_1106353
Type:
Small organic molecule
Emp. Form.:
C23H21ClN2O
Mol. Mass.:
376.879
SMILES:
Clc1ccc(NC(=O)c2ccc(CN3CCc4ccccc4C3)cc2)cc1
: