Target
Nucleotide-binding oligomerization domain-containing protein 1
Ligand
BDBM62295
Substrate
Meas. Tech.
SAR analysis of compounds that inhibit NOD1 revised
IC50
513±n/a nM
Citation
 PubChem, PC SAR analysis of compounds that inhibit NOD1 revised PubChem Bioassay (2010)[AID] 
Target
Name:
Nucleotide-binding oligomerization domain-containing protein 1
Synonyms:
CARD4 NOD1_HUMAN | nucleotide-binding oligomerization domain containing 1
Type:
Enzyme Catalytic Domain
Mol. Mass.:
107699.03
Organism:
Homo sapiens (Human)
Description:
gi_5174617
Residue:
953
  
Inhibitor
Name:
BDBM62295
Synonyms:
4-(3,4-dihydro-1H-isoquinolin-2-ylmethyl)-N-(4-methoxyphenyl)benzamide cid_1360138
Type:
Small organic molecule
Emp. Form.:
C24H24N2O2
Mol. Mass.:
372.4596
SMILES:
COc1ccc(NC(=O)c2ccc(CN3CCc4ccccc4C3)cc2)cc1
: