Target
Nucleotide-binding oligomerization domain-containing protein 1
Ligand
BDBM62170
Substrate
Meas. Tech.
SAR analysis of compounds that inhibit NOD1 revised
IC50
485±n/a nM
Citation
 PubChem, PC SAR analysis of compounds that inhibit NOD1 revised PubChem Bioassay (2010)[AID] 
Target
Name:
Nucleotide-binding oligomerization domain-containing protein 1
Synonyms:
CARD4 NOD1_HUMAN | nucleotide-binding oligomerization domain containing 1
Type:
Enzyme Catalytic Domain
Mol. Mass.:
107699.03
Organism:
Homo sapiens (Human)
Description:
gi_5174617
Residue:
953
  
Inhibitor
Name:
BDBM62170
Synonyms:
1-(4-chlorophenyl)sulfonyl-2-benzimidazolamine MLS-0425609.0001 [1-(4-chlorophenyl)sulfonylbenzimidazol-2-yl]amine | cid_1088439
Type:
Small organic molecule
Emp. Form.:
C13H10ClN3O2S
Mol. Mass.:
307.755
SMILES:
Nc1nc2ccccc2n1S(=O)(=O)c1ccc(Cl)cc1
: