Target
Nucleotide-binding oligomerization domain-containing protein 1
Ligand
BDBM54464
Substrate
Meas. Tech.
SAR analysis of compounds that inhibit NOD1 revised
IC50
7180±n/a nM
Citation
 PubChem, PC SAR analysis of compounds that inhibit NOD1 revised PubChem Bioassay (2010)[AID] 
Target
Name:
Nucleotide-binding oligomerization domain-containing protein 1
Synonyms:
CARD4 NOD1_HUMAN | nucleotide-binding oligomerization domain containing 1
Type:
Enzyme Catalytic Domain
Mol. Mass.:
107699.03
Organism:
Homo sapiens (Human)
Description:
gi_5174617
Residue:
953
  
Inhibitor
Name:
BDBM54464
Synonyms:
MLS001066639 N-(4,6-difluoro-1,3-benzothiazol-2-yl)-5-nitro-2-furancarboxamide N-[4,6-bis(fluoranyl)-1,3-benzothiazol-2-yl]-5-nitro-furan-2-carboxamide cid_2307752
Type:
Small organic molecule
Emp. Form.:
C12H5F2N3O4S
Mol. Mass.:
325.248
SMILES:
[O-][N+](=O)c1ccc(o1)C(=O)Nc1nc2c(F)cc(F)cc2s1
: