Target
Nucleotide-binding oligomerization domain-containing protein 2
Ligand
BDBM62321
Substrate
Meas. Tech.
SAR analysis of compounds that inhibit NOD2 revised
IC50
20000±n/a nM
Citation
 PubChem, PC SAR analysis of compounds that inhibit NOD2 revised PubChem Bioassay (2010)[AID] 
Target
Name:
Nucleotide-binding oligomerization domain-containing protein 2
Synonyms:
CARD15 IBD1 NOD2 Nucleotide-binding oligomerization domain-containing protein 2 | nucleotide-binding oligomerization domain containing 2
Type:
PROTEIN
Mol. Mass.:
115287.18
Organism:
Homo sapiens (Human)
Description:
ChEMBL_1454053
Residue:
1040
  
Inhibitor
Name:
BDBM62321
Synonyms:
1-[5-[4-(4-acetylphenyl)piperazin-1-yl]sulfonyl-2,3-dihydroindol-1-yl]propan-1-one 1-[5-[4-(4-ethanoylphenyl)piperazin-1-yl]sulfonyl-2,3-dihydroindol-1-yl]propan-1-one MLS-0425663.0001 | cid_15994862
Type:
Small organic molecule
Emp. Form.:
C23H27N3O4S
Mol. Mass.:
441.543
SMILES:
CCC(=O)N1CCc2cc(ccc12)S(=O)(=O)N1CCN(CC1)c1ccc(cc1)C(C)=O
: