Target
Nucleotide-binding oligomerization domain-containing protein 2
Ligand
BDBM62342
Substrate
Meas. Tech.
SAR analysis of compounds that inhibit NOD2 revised
IC50
20000±n/a nM
Citation
 PubChem, PC SAR analysis of compounds that inhibit NOD2 revised PubChem Bioassay (2010)[AID] 
Target
Name:
Nucleotide-binding oligomerization domain-containing protein 2
Synonyms:
CARD15 IBD1 NOD2 Nucleotide-binding oligomerization domain-containing protein 2 | nucleotide-binding oligomerization domain containing 2
Type:
PROTEIN
Mol. Mass.:
115287.18
Organism:
Homo sapiens (Human)
Description:
ChEMBL_1454053
Residue:
1040
  
Inhibitor
Name:
BDBM62342
Synonyms:
1-[5-[4-(4-chlorophenyl)piperazin-1-yl]sulfonyl-2,3-dihydroindol-1-yl]ethanone 1-[5-[[4-(4-chlorophenyl)-1-piperazinyl]sulfonyl]-2,3-dihydroindol-1-yl]ethanone cid_44543518
Type:
Small organic molecule
Emp. Form.:
C20H22ClN3O3S
Mol. Mass.:
419.925
SMILES:
CC(=O)N1CCc2cc(ccc12)S(=O)(=O)N1CCN(CC1)c1ccc(Cl)cc1
: