Target
Nucleotide-binding oligomerization domain-containing protein 2
Ligand
BDBM59530
Substrate
Meas. Tech.
SAR analysis of compounds that inhibit NOD2 revised
IC50
19700±n/a nM
Citation
 PubChem, PC SAR analysis of compounds that inhibit NOD2 revised PubChem Bioassay (2010)[AID] 
Target
Name:
Nucleotide-binding oligomerization domain-containing protein 2
Synonyms:
CARD15 IBD1 NOD2 Nucleotide-binding oligomerization domain-containing protein 2 | nucleotide-binding oligomerization domain containing 2
Type:
PROTEIN
Mol. Mass.:
115287.18
Organism:
Homo sapiens (Human)
Description:
ChEMBL_1454053
Residue:
1040
  
Inhibitor
Name:
BDBM59530
Synonyms:
4-methyl-N-[(5-nitro-2-furanyl)methylideneamino]-1,2,5-oxadiazole-3-carboxamide 4-methyl-N-[(5-nitrofuran-2-yl)methylideneamino]-1,2,5-oxadiazole-3-carboxamide SMR000282110 | cid_3097411
Type:
Small organic molecule
Emp. Form.:
C9H7N5O5
Mol. Mass.:
265.1824
SMILES:
Cc1nonc1C(=O)N\N=C\c1ccc(o1)[N+]([O-])=O
: