Target
Nucleotide-binding oligomerization domain-containing protein 2
Ligand
BDBM54323
Substrate
Meas. Tech.
SAR analysis of compounds that inhibit NOD2 revised
IC50
9950±n/a nM
Citation
 PubChem, PC SAR analysis of compounds that inhibit NOD2 revised PubChem Bioassay (2010)[AID] 
Target
Name:
Nucleotide-binding oligomerization domain-containing protein 2
Synonyms:
CARD15 IBD1 NOD2 Nucleotide-binding oligomerization domain-containing protein 2 | nucleotide-binding oligomerization domain containing 2
Type:
PROTEIN
Mol. Mass.:
115287.18
Organism:
Homo sapiens (Human)
Description:
ChEMBL_1454053
Residue:
1040
  
Inhibitor
Name:
BDBM54323
Synonyms:
MLS000673649 N-(2,5-dichlorophenyl)-2-[[4-keto-6-[(p-tolylthio)methyl]-1H-pyrimidin-2-yl]thio]acetamide N-(2,5-dichlorophenyl)-2-[[6-[[(4-methylphenyl)thio]methyl]-4-oxo-1H-pyrimidin-2-yl]thio]acetamide SMR000298180 | cid_1371060
Type:
Small organic molecule
Emp. Form.:
C20H17Cl2N3O2S2
Mol. Mass.:
466.404
SMILES:
Cc1ccc(SCc2cc(=O)[nH]c(SCC(=O)Nc3cc(Cl)ccc3Cl)n2)cc1
: