Target
Nucleotide-binding oligomerization domain-containing protein 2
Ligand
BDBM62359
Substrate
Meas. Tech.
SAR analysis of compounds that inhibit NOD2 revised
IC50
20000±n/a nM
Citation
 PubChem, PC SAR analysis of compounds that inhibit NOD2 revised PubChem Bioassay (2010)[AID] 
Target
Name:
Nucleotide-binding oligomerization domain-containing protein 2
Synonyms:
CARD15 IBD1 NOD2 Nucleotide-binding oligomerization domain-containing protein 2 | nucleotide-binding oligomerization domain containing 2
Type:
PROTEIN
Mol. Mass.:
115287.18
Organism:
Homo sapiens (Human)
Description:
ChEMBL_1454053
Residue:
1040
  
Inhibitor
Name:
BDBM62359
Synonyms:
5,5-dimethyl-2-[(2-morpholinoacetyl)amino]-4,7-dihydrothieno[2,3-c]pyran-3-carboxylic acid ethyl ester MLS-0000715.0001 ethyl 5,5-dimethyl-2-(2-morpholin-4-ylethanoylamino)-4,7-dihydrothieno[2,3-c]pyran-3-carboxylate | ethyl 5,5-dimethyl-2-[(2-morpholin-4-ylacetyl)amino]-4,7-dihydrothieno[2,3-c]pyran-3-carboxylate
Type:
Small organic molecule
Emp. Form.:
C18H26N2O5S
Mol. Mass.:
382.474
SMILES:
CCOC(=O)c1c(NC(=O)CN2CCOCC2)sc2COC(C)(C)Cc12
: