Target
Nucleotide-binding oligomerization domain-containing protein 2
Ligand
BDBM54373
Substrate
Meas. Tech.
SAR analysis of compounds that inhibit NOD2 revised
IC50
8050±n/a nM
Citation
 PubChem, PC SAR analysis of compounds that inhibit NOD2 revised PubChem Bioassay (2010)[AID] 
Target
Name:
Nucleotide-binding oligomerization domain-containing protein 2
Synonyms:
CARD15 IBD1 NOD2 Nucleotide-binding oligomerization domain-containing protein 2 | nucleotide-binding oligomerization domain containing 2
Type:
PROTEIN
Mol. Mass.:
115287.18
Organism:
Homo sapiens (Human)
Description:
ChEMBL_1454053
Residue:
1040
  
Inhibitor
Name:
BDBM54373
Synonyms:
1-Heptyl-4-hydroxy-2-oxo-1,2-dihydro-quinoline-3-carboxylic acid pyrazin-2-ylamide 1-heptyl-2-hydroxy-4-oxo-N-(2-pyrazinyl)-3-quinolinecarboxamide 1-heptyl-2-oxidanyl-4-oxidanylidene-N-pyrazin-2-yl-quinoline-3-carboxamide SMR000427414 | cid_1593351
Type:
Small organic molecule
Emp. Form.:
C21H24N4O3
Mol. Mass.:
380.4403
SMILES:
CCCCCCCn1c2ccccc2c(O)c(C(=O)Nc2cnccn2)c1=O
: