Target
Nucleotide-binding oligomerization domain-containing protein 2
Ligand
BDBM54265
Substrate
Meas. Tech.
SAR analysis of compounds that inhibit NOD2 revised
IC50
12000±n/a nM
Citation
 PubChem, PC SAR analysis of compounds that inhibit NOD2 revised PubChem Bioassay (2010)[AID] 
Target
Name:
Nucleotide-binding oligomerization domain-containing protein 2
Synonyms:
CARD15 IBD1 NOD2 Nucleotide-binding oligomerization domain-containing protein 2 | nucleotide-binding oligomerization domain containing 2
Type:
PROTEIN
Mol. Mass.:
115287.18
Organism:
Homo sapiens (Human)
Description:
ChEMBL_1454053
Residue:
1040
  
Inhibitor
Name:
BDBM54265
Synonyms:
4-[2-[[3-(4-ethylphenyl)-4-keto-quinazolin-2-yl]thio]acetyl]-2,5-dimethyl-1H-pyrrole-3-carboxylic acid ethyl ester MLS000394905 cid_2419087 ethyl 4-[2-[3-(4-ethylphenyl)-4-oxoquinazolin-2-yl]sulfanylacetyl]-2,5-dimethyl-1H-pyrrole-3-carboxylate
Type:
Small organic molecule
Emp. Form.:
C27H27N3O4S
Mol. Mass.:
489.586
SMILES:
CCOC(=O)c1c(C)[nH]c(C)c1C(=O)CSc1nc2ccccc2c(=O)n1-c1ccc(CC)cc1
: