Target
Nucleotide-binding oligomerization domain-containing protein 2
Ligand
BDBM62376
Substrate
Meas. Tech.
SAR analysis of compounds that inhibit NOD2 revised
IC50
20000±n/a nM
Citation
 PubChem, PC SAR analysis of compounds that inhibit NOD2 revised PubChem Bioassay (2010)[AID] 
Target
Name:
Nucleotide-binding oligomerization domain-containing protein 2
Synonyms:
CARD15 IBD1 NOD2 Nucleotide-binding oligomerization domain-containing protein 2 | nucleotide-binding oligomerization domain containing 2
Type:
PROTEIN
Mol. Mass.:
115287.18
Organism:
Homo sapiens (Human)
Description:
ChEMBL_1454053
Residue:
1040
  
Inhibitor
Name:
BDBM62376
Synonyms:
MLS-0435450.0001 N-[1-[(4-chlorophenyl)methyl]-2-benzimidazolyl]-2-methylpropanamide N-[1-[(4-chlorophenyl)methyl]benzimidazol-2-yl]-2-methylpropanamide | cid_44543521
Type:
Small organic molecule
Emp. Form.:
C18H18ClN3O
Mol. Mass.:
327.808
SMILES:
CC(C)C(=O)Nc1nc2ccccc2n1Cc1ccc(Cl)cc1
: