Target
Nucleotide-binding oligomerization domain-containing protein 2
Ligand
BDBM62382
Substrate
Meas. Tech.
SAR analysis of compounds that inhibit NOD2 revised
IC50
20000±n/a nM
Citation
 PubChem, PC SAR analysis of compounds that inhibit NOD2 revised PubChem Bioassay (2010)[AID] 
Target
Name:
Nucleotide-binding oligomerization domain-containing protein 2
Synonyms:
CARD15 IBD1 NOD2 Nucleotide-binding oligomerization domain-containing protein 2 | nucleotide-binding oligomerization domain containing 2
Type:
PROTEIN
Mol. Mass.:
115287.18
Organism:
Homo sapiens (Human)
Description:
ChEMBL_1454053
Residue:
1040
  
Inhibitor
Name:
BDBM62382
Synonyms:
MLS-0435456.0001 N-[1-(4-chlorophenyl)sulfonylbenzimidazol-2-yl]acetamide cid_44543512
Type:
Small organic molecule
Emp. Form.:
C15H12ClN3O3S
Mol. Mass.:
349.792
SMILES:
CC(=O)Nc1nc2ccccc2n1S(=O)(=O)c1ccc(Cl)cc1
: